BDBM50447426 CHEMBL3115137
SMILES COc1ccc(CCNC(=O)CCCNS(=O)(=O)c2ccc3[nH]c(=O)oc3c2)cc1OC
InChI Key InChIKey=TXVCWDBCQVEUNW-UHFFFAOYSA-N
Data  3 IC50
  Tab Delimited (TSV)   2D SDfile   Computed 3D by Vconf -m prep SDfile
Find this compound or compounds like it in BindingDB:
Activity Spreadsheet -- Enzyme Inhibition Constant Data from BindingDB
Found 1 hit for monomerid = 50447426
TargetIntestinal-type alkaline phosphatase(Mus musculus)
Sanford-Burnham Medical Research Institute
Curated by ChEMBL
LigandPNGBDBM50447426(CHEMBL3115137)
Affinity DataIC50:  1.50E+3nM. Assay description: Inhibition of mouse duodenal-specific FLAG-tagged IAP expressed in African green monkey COS1 cells after 30 mins by chemiluminescence assay
In DepthDetails ArticlePubMed